Reaction Details
TargetBeta-3 adrenergic receptor
LigandBDBM50106801
Substrate/Competitorn/a
Meas. Tech.ChEBML_39052
Ki 44±n/a nM
Citation Washburn, WNSher, PMPoss, KMGirotra, RNMcCann, PJGavai, AVMikkilineni, ABMathur, ACheng, PDejneka, TCSun, CQWang, TCHarper, TWRussell, ADSlusarchyk, DASkwish, SAllen, GTHillyer, DEFrohlich, BHAbboa-Offei, BECap, MWaldron, TLGeorge, RJTesfamariam, BCiosek, CPRyono, DYoung, DADickinson, KESeymour, AAArbeeny, CMGregg, RE Beta 3 agonists. Part 1: evolution from inception to BMS-194449. Bioorg Med Chem Lett11:3035-9 (2001) Beta-3 adrenergic receptor
Name:Beta-3 adrenergic receptor
Type:G Protein-Coupled Receptor (GPCR)
Mol. Mass.:43534.88
Organism:Homo sapiens (Human)
Description:n/a
Residue:408
BDBM50106801
NameBDBM50106801
Synonyms:CHEMBL102928 | N-(2-Hydroxy-5-{1-hydroxy-2-[1-(4-methoxy-phenyl)-2-phenyl-ethylamino]-ethyl}-phenyl)-methanesulfonamide
TypeSmall organic molecule
Emp. Form.C24H28N2O5S
Mol. Mass.456.555
SMILESCOc1ccc(cc1)C(Cc1ccccc1)NCC(O)c1ccc(O)c(NS(C)(=O)=O)c1