Reaction Details
TargetBeta-3 adrenergic receptor
LigandBDBM50106806
Substrate/Competitorn/a
Meas. Tech.ChEBML_39052
Ki 81±n/a nM
Citation Washburn, WNSher, PMPoss, KMGirotra, RNMcCann, PJGavai, AVMikkilineni, ABMathur, ACheng, PDejneka, TCSun, CQWang, TCHarper, TWRussell, ADSlusarchyk, DASkwish, SAllen, GTHillyer, DEFrohlich, BHAbboa-Offei, BECap, MWaldron, TLGeorge, RJTesfamariam, BCiosek, CPRyono, DYoung, DADickinson, KESeymour, AAArbeeny, CMGregg, RE Beta 3 agonists. Part 1: evolution from inception to BMS-194449. Bioorg Med Chem Lett11:3035-9 (2001) Beta-3 adrenergic receptor
Name:Beta-3 adrenergic receptor
Type:G Protein-Coupled Receptor (GPCR)
Mol. Mass.:43534.88
Organism:Homo sapiens (Human)
Description:n/a
Residue:408
BDBM50106806
NameBDBM50106806
Synonyms:(R)-N-(5-(2-(1,1-bis(4-(difluoromethoxy)phenyl)ethylamino)-1-hydroxyethyl)-2-hydroxyphenyl)methanesulfonamide N-(5-{(R)-2-[1,1-Bis-(4-difluoromethoxy-phenyl)-ethylamino]-1-hydroxy-ethyl}-2-hydroxy-phenyl)-methanesulfonamide
TypeSmall organic molecule
Emp. Form.C25H26F4N2O6S
Mol. Mass.558.542
SMILESCC(NC[C@H](O)c1ccc(O)c(NS(C)(=O)=O)c1)(c1ccc(OC(F)F)cc1)c1ccc(OC(F)F)cc1