Reaction Details
TargetBeta-3 adrenergic receptor
LigandBDBM50106811
Substrate/Competitorn/a
Meas. Tech.ChEBML_39052
Ki 220±n/a nM
Citation Washburn, WNSher, PMPoss, KMGirotra, RNMcCann, PJGavai, AVMikkilineni, ABMathur, ACheng, PDejneka, TCSun, CQWang, TCHarper, TWRussell, ADSlusarchyk, DASkwish, SAllen, GTHillyer, DEFrohlich, BHAbboa-Offei, BECap, MWaldron, TLGeorge, RJTesfamariam, BCiosek, CPRyono, DYoung, DADickinson, KESeymour, AAArbeeny, CMGregg, RE Beta 3 agonists. Part 1: evolution from inception to BMS-194449. Bioorg Med Chem Lett11:3035-9 (2001) Beta-3 adrenergic receptor
Name:Beta-3 adrenergic receptor
Type:G Protein-Coupled Receptor (GPCR)
Mol. Mass.:43534.88
Organism:Homo sapiens (Human)
Description:n/a
Residue:408
BDBM50106811
NameBDBM50106811
Synonyms:2-[(R)-2-Hydroxy-2-(4-hydroxy-3-methanesulfonylamino-phenyl)-ethylamino]-2,2-bis-(4-methoxy-phenyl)-acetamide | CHEMBL102759
TypeSmall organic molecule
Emp. Form.C25H29N3O7S
Mol. Mass.515.579
SMILESCOc1ccc(cc1)C(NC[C@H](O)c1ccc(O)c(NS(C)(=O)=O)c1)(C(N)=O)c1ccc(OC)cc1