Reaction Details
TargetMetabotropic glutamate receptor 2
LigandBDBM50062522
Substrate/Competitorn/a
Meas. Tech.ChEMBL_219670 (CHEMBL820340)
IC50 200±n/a nM
Citation Pellicciari, RCostantino, GMarinozzi, MMacchiarulo, AAmori, LJosef Flor, PGasparini, FKuhn, RUrwyler, S Design, synthesis and preliminary evaluation of novel 3'-substituted carboxycyclopropylglycines as antagonists at group 2 metabotropic glutamate receptors. Bioorg Med Chem Lett11:3179-82 (2001) Metabotropic glutamate receptor 2
Name:Metabotropic glutamate receptor 2
Type:Enzyme
Mol. Mass.:95584.88
Organism:Homo sapiens (Human)
Description:Q14416
Residue:872
BDBM50062522
NameBDBM50062522
Synonyms:(1S,2S)-2-((S)-1-amino-1-carboxy-2-(9H-xanthen-9-yl)ethyl)cyclopropanecarboxylic acid (1S,2S)-2-[(S)-1-Amino-1-carboxy-2-(9H-xanthen-9-yl)-ethyl]-cyclopropanecarboxylic acid (S)-2-[(S)-1-Amino-1-carboxy-2-(9H-xanthen-9-yl)-ethyl]-cyclopropanecarboxylic acid 2-[1-Amino-1-carboxy-2-(9H-xanthen-9-yl)-ethyl]-cyclopropanecarboxylic acid(LY341495) | CHEMBL432038
TypeSmall organic molecule
Emp. Form.C20H19NO5
Mol. Mass.353.3686
SMILESN[C@@](CC1c2ccccc2Oc2ccccc12)([C@H]1C[C@@H]1C(O)=O)C(O)=O