Reaction Details
TargetReverse transcriptase/RNaseH
LigandBDBM1317
Substrate/Competitorn/a
Meas. Tech.ChEBML_140633
IC50 19±n/a nM
Citation Corbett, JWKresge, KJPan, SCordova, BCKlabe, RMRodgers, JDErickson-Viitanen, SK Trifluoromethyl-containing 3-alkoxymethyl- and 3-aryloxymethyl-2-pyridinones are potent inhibitors of HIV-1 non-nucleoside reverse transcriptase. Bioorg Med Chem Lett11:309-12 (2001) Reverse transcriptase/RNaseH
Name:Reverse transcriptase/RNaseH
Type:PROTEIN
Mol. Mass.:65229.15
Organism:Human immunodeficiency virus 1
Description:ChEMBL_1473730
Residue:566
BDBM1317
NameBDBM1317
Synonyms:3-[[(4,7-Dichlorobenzoxazol-2-yl)-methyl]amino]-5-ethyl-6-methylpyridin-2(1H)-one CHEMBL268871 Pyridinone deriv.
TypeSmall organic molecule
Emp. Form.C16H15Cl2N3O2
Mol. Mass.352.215
SMILESCCc1cc(NCc2nc3c(Cl)ccc(Cl)c3o2)c(=O)[nH]c1C