Reaction Details
TargetReverse transcriptase/RNaseH
LigandBDBM2483
Substrate/Competitorn/a
Meas. Tech.ChEBML_140633
IC50 47±n/a nM
Citation Corbett, JWKresge, KJPan, SCordova, BCKlabe, RMRodgers, JDErickson-Viitanen, SK Trifluoromethyl-containing 3-alkoxymethyl- and 3-aryloxymethyl-2-pyridinones are potent inhibitors of HIV-1 non-nucleoside reverse transcriptase. Bioorg Med Chem Lett11:309-12 (2001) Reverse transcriptase/RNaseH
Name:Reverse transcriptase/RNaseH
Type:PROTEIN
Mol. Mass.:65229.15
Organism:Human immunodeficiency virus 1
Description:ChEMBL_1473730
Residue:566
BDBM2483
NameBDBM2483
Synonyms:(4S)-6-chloro-4-(2-cyclopropylethynyl)-4-(trifluoromethyl)-2,4-dihydro-1H-3,1-benzoxazin-2-one DMP-266 Efavirenz L-743,726 | Sustiva
TypeSmall organic molecule
Emp. Form.C14H9ClF3NO2
Mol. Mass.315.675
SMILESFC(F)(F)[C@]1(OC(=O)Nc2ccc(Cl)cc12)C#CC1CC1