Reaction Details
TargetReverse transcriptase/RNaseH
LigandBDBM50096674
Substrate/Competitorn/a
Meas. Tech.ChEBML_140633
IC50 770±n/a nM
Citation Corbett, JWKresge, KJPan, SCordova, BCKlabe, RMRodgers, JDErickson-Viitanen, SK Trifluoromethyl-containing 3-alkoxymethyl- and 3-aryloxymethyl-2-pyridinones are potent inhibitors of HIV-1 non-nucleoside reverse transcriptase. Bioorg Med Chem Lett11:309-12 (2001) Reverse transcriptase/RNaseH
Name:Reverse transcriptase/RNaseH
Type:PROTEIN
Mol. Mass.:65229.15
Organism:Human immunodeficiency virus 1
Description:ChEMBL_1473730
Residue:566
BDBM50096674
NameBDBM50096674
Synonyms:3-(3-Cyclopropyl-1-methoxy-1-trifluoromethyl-prop-2-ynyl)-5-ethyl-6-methyl-1H-pyridin-2-one | CHEMBL106646
TypeSmall organic molecule
Emp. Form.C16H18F3NO2
Mol. Mass.313.3148
SMILESCCc1cc(c(=O)[nH]c1C)C(OC)(C#CC1CC1)C(F)(F)F