Reaction Details
TargetNeuronal acetylcholine receptor subunit alpha-7
LigandBDBM50000483
Substrate/Competitorn/a
Meas. Tech.ChEMBL_144033 (CHEMBL750448)
Ki>10000±n/a nM
Citation Macor, JEGurley, DLanthorn, TLoch, JMack, RAMullen, GTran, OWright, NGordon, JC The 5-HT3 antagonist tropisetron (ICS 205-930) is a potent and selective alpha7 nicotinic receptor partial agonist. Bioorg Med Chem Lett11:319-21 (2001) Neuronal acetylcholine receptor subunit alpha-7
Name:Neuronal acetylcholine receptor subunit alpha-7
Type:PROTEIN
Mol. Mass.:56632.61
Organism:Mus musculus
Description:ChEMBL_144033
Residue:502
BDBM50000483
NameBDBM50000483
Synonyms:(BRL 43694)1-Methyl-1H-indazole-3-carboxylic acid (9-methyl-9-aza-bicyclo[3.3.1]non-3-yl)-amide 1-Methyl-1H-indazole-3-carboxylic acid (8-methyl-8-aza-bicyclo[3.2.1]oct-3-yl)-amide 1-Methyl-1H-indazole-3-carboxylic acid (9-methyl-9-aza-bicyclo[3.3.1]non-3-yl)-amide(BRL 43694) 1-methyl-N-((1S,5R)-9-methyl-9-aza-bicyclo[3.3.1]nonan-3-yl)-1H-indazole-3-carboxamide BRL 43694 CHEMBL519643 LY-278584
TypeSmall organic molecule
Emp. Form.C18H24N4O
Mol. Mass.312.4094
SMILESCN1C2CCCC1CC(C2)NC(=O)c1nn(C)c2ccccc12