Reaction Details
TargetCarbonic anhydrase 4
LigandBDBM50097275
Substrate/Competitorn/a
Meas. Tech.ChEBML_219473
Ki 6±n/a nM
Citation Scozzafava, AMenabuoni, LMincione, FMincione, GSupuran, CT Carbonic anhydrase inhibitors: synthesis of sulfonamides incorporating dtpa tails and of their zinc complexes with powerful topical antiglaucoma properties. Bioorg Med Chem Lett11:575-82 (2001) Carbonic anhydrase 4
Name:Carbonic anhydrase 4
Type:Enzyme
Mol. Mass.:35037.98
Organism:Homo sapiens (Human)
Description:P22748
Residue:312
BDBM50097275
NameBDBM50097275
Synonyms:CHEMBL286586 | {{2-[Carboxymethyl-(2-{carboxymethyl-[(2-sulfamoyl-benzothiazol-6-ylcarbamoyl)-methyl]-amino}-ethyl)-amino]-ethyl}-[(2-sulfamoyl-benzothiazol-6-ylcarbamoyl)-methyl]-amino}-acetic acid
TypeSmall organic molecule
Emp. Form.C28H33N9O12S4
Mol. Mass.815.875
SMILESNS(=O)(=O)c1nc2ccc(NC(=O)CN(CCN(CCN(CC(O)=O)CC(=O)Nc3ccc4nc(sc4c3)S(N)(=O)=O)CC(O)=O)CC(O)=O)cc2s1