Reaction Details
TargetCarbonic anhydrase 4
LigandBDBM50097288
Substrate/Competitorn/a
Meas. Tech.ChEBML_219473
Ki 8±n/a nM
Citation Scozzafava, AMenabuoni, LMincione, FMincione, GSupuran, CT Carbonic anhydrase inhibitors: synthesis of sulfonamides incorporating dtpa tails and of their zinc complexes with powerful topical antiglaucoma properties. Bioorg Med Chem Lett11:575-82 (2001) Carbonic anhydrase 4
Name:Carbonic anhydrase 4
Type:Enzyme
Mol. Mass.:35037.98
Organism:Homo sapiens (Human)
Description:P22748
Residue:312
BDBM50097288
NameBDBM50097288
Synonyms:((2-{Carboxymethyl-[2-(carboxymethyl-{[2-(5-sulfamoyl-[1,3,4]thiadiazol-2-ylcarbamoyl)-ethylcarbamoyl]-methyl}-amino)-ethyl]-amino}-ethyl)-{[2-(5-sulfamoyl-[1,3,4]thiadiazol-2-ylcarbamoyl)-ethylcarbamoyl]-methyl}-amino)-acetic acid | CHEMBL285516
TypeSmall organic molecule
Emp. Form.C24H37N13O14S4
Mol. Mass.859.889
SMILESNS(=O)(=O)c1nnc(NC(=O)CCNC(=O)CN(CCN(CCN(CC(O)=O)CC(=O)NCCC(=O)Nc2nnc(s2)S(N)(=O)=O)CC(O)=O)CC(O)=O)s1