Reaction Details
TargetReverse transcriptase/RNaseH
LigandBDBM50097574
Substrate/Competitorn/a
Meas. Tech.ChEBML_195511
IC50 12500±n/a nM
Citation Markwalder, JAChrist, DDMutlib, ACordova, BCKlabe, RMSeitz, SP Synthesis and biological activities of potential metabolites of the non-nucleoside reverse transcriptase inhibitor efavirenz. Bioorg Med Chem Lett11:619-22 (2001) Reverse transcriptase/RNaseH
Name:Reverse transcriptase/RNaseH
Type:PROTEIN
Mol. Mass.:65229.15
Organism:Human immunodeficiency virus 1
Description:ChEMBL_1473730
Residue:566
BDBM50097574
NameBDBM50097574
Synonyms:CHEMBL346585 | Sulfuric acid mono-((S)-6-chloro-4-cyclopropylethynyl-2-oxo-4-trifluoromethyl-1,4-dihydro-2H-benzo[d][1,3]oxazin-8-yl) ester; compound with pyridine
TypeSmall organic molecule
Emp. Form.C14H9ClF3NO6S
Mol. Mass.411.738
SMILESOS(=O)(=O)Oc1cc(Cl)cc2c1NC(=O)O[C@]2(C#CC1CC1)C(F)(F)F