Reaction Details
TargetNeuraminidase
LigandBDBM50330326
Substrate/Competitorn/a
Meas. Tech.ChEBML_200639
IC50 2±n/a nM
Citation Wyatt, PGCoomber, BAEvans, DNJack, TIFulton, HEWonacott, AJColman, PVarghese, J Sialidase inhibitors related to zanamivir. Further SAR studies of 4-amino-4H-pyran-2-carboxylic acid-6-propylamides. Bioorg Med Chem Lett11:669-73 (2001) Neuraminidase
Name:Neuraminidase
Type:Enzyme
Mol. Mass.:50124.14
Organism:Influenza A virus (A/Puerto Rico/8/34/Mount Sinai(H1N1))
Description:P03468
Residue:454
BDBM50330326
NameBDBM50330326
Synonyms:(4S,5R,6R)-5-Acetylamino-4-guanidino-6-((1R,3R)-1,2,3-trihydroxy-propyl)-5,6-dihydro-4H-pyran-2-carboxylic acid (4S,5R,6R)-5-Acetylamino-4-guanidino-6-(1,2,3-trihydroxy-propyl)-5,6-dihydro-4H-pyran-2-carboxylic acid (4S,5R,6R)-5-acetylamino-4-guanidino-6-((1R,2R)-1,2,3-trihydroxy-propy)-5,6-dihydro-4H-pyran-2-carboxylic acid 4-diaminomethylamino-3-methylcarboxamido-2-(1,2,3-trihydroxypropyl)-(3R)-3,4-dihydro-2H-6-pyrancarboxylic acid(Zanamivir) 5-Acetylamino-4-guanidino-6-(1,2,3-trihydroxy-propyl)-5,6-dihydro-4H-pyran-2-carboxylic acid(zanamivir) CHEMBL222813 Relenza | Zanamivi
TypeSmall organic molecule
Emp. Form.C12H20N4O7
Mol. Mass.332.3098
SMILES[#6]-[#6](=O)-[#7]-[#6@@H]-1-[#6@H](-[#6]=[#6](-[#8]-[#6@H]-1-[#6@H](-[#8])-[#6@H](-[#8])-[#6]-[#8])-[#6](-[#8])=O)\[#7]=[#6](\[#7])-[#7]