Reaction Details
TargetSubstance-P receptor
LigandBDBM50000041
Substrate/Competitorn/a
Meas. Tech.ChEMBL_205410 (CHEMBL812233)
IC50 2.9±n/a nM
Citation Dziadulewicz, EKWalpole, CSSnell, CRWrigglesworth, RHughes, GABeattie, DWood, JNBeech, MMCoote, PR Design of non-peptide CCK2 and NK1 peptidomimetics using 1-(2-nitrophenyl)thiosemicarbazide as a novel common scaffold. Bioorg Med Chem Lett11:705-9 (2001) Substance-P receptor
Name:Substance-P receptor
Type:Enzyme Catalytic Domain
Mol. Mass.:46261.42
Organism:GUINEA PIG
Description:Neurokinin NK1 TACR1 GUINEA PIG::P30547
Residue:407
BDBM50000041
NameBDBM50000041
Synonyms:(+) (2-Methoxy-benzyl)-(2-phenyl-piperidin-3-yl)-amine (+/-)(2-Methoxy-benzyl)-(2-phenyl-piperidin-3-yl)-amine (-)-(2-Methoxy-benzyl)-(2-phenyl-piperidin-3-yl)-amine (2-Methoxy-benzyl)-((2S,3S)-2-phenyl-piperidin-3-yl)-amine (2S,3S)-3-(2-Methoxy-benzyloxy)-2-phenyl-piperidine CHEMBL2114310 CP 99994 Tritiated-(2-Methoxy-benzyl)-(2-phenyl-piperidin-3-yl)-amine
TypeSmall organic molecule
Emp. Form.C19H24N2O
Mol. Mass.296.4067
SMILESCOc1ccccc1CN[C@H]1CCCN[C@H]1c1ccccc1