Reaction Details
TargetSomatostatin receptor type 3
LigandBDBM50219321
Substrate/Competitorn/a
Meas. Tech.ChEMBL_200508 (CHEMBL803852)
Ki 1200±n/a nM
Citation Contour-Galéra, MOPoitout, LMoinet, CMorgan, BGordon, TRoubert, PThurieau, C Synthesis of substituted imidazopyrazines as ligands for the human somatostatin receptor subtype 5. Bioorg Med Chem Lett11:741-5 (2001) Somatostatin receptor type 3
Name:Somatostatin receptor type 3
Type:Protein
Mol. Mass.:45855.97
Organism:Homo sapiens (Human)
Description:P32745
Residue:418
BDBM50219321
NameBDBM50219321
Synonyms:CHEMBL2112934
TypeSmall organic molecule
Emp. Form.C30H34N6O
Mol. Mass.494.6306
SMILESCC(C)(C(=O)NCCc1c[nH]c2ccccc12)c1cn2cc(Cc3ccccc3)nc(CCCN)c2n1