Reaction Details
TargetDelta-type opioid receptor
LigandBDBM50451343
Substrate/Competitorn/a
Meas. Tech.ChEBML_147168
Ki 0.490000±n/a nM
Citation Clayson, JJales, ATyacke, RJHudson, ALNutt, DJLewis, JWHusbands, SM Selective delta-opioid receptor ligands: potential PET ligands based on naltrindole. Bioorg Med Chem Lett11:939-43 (2001) Delta-type opioid receptor
Name:Delta-type opioid receptor
Type:G Protein-Coupled Receptor (GPCR)
Mol. Mass.:40382.98
Organism:Homo sapiens (Human)
Description:Competition binding assays were carried out using membrane preparations from transfected HN9.10 cells that constitutively expressed the delta opioid receptor.
Residue:372
BDBM50451343
NameBDBM50451343
Synonyms:CHEMBL477154
TypeSmall organic molecule
Emp. Form.C27H28N2O3
Mol. Mass.428.5228
SMILES[H][C@@]12Oc3c4c(C[C@@]5([H])N(CC6CC6)CC[C@@]14[C@@]5(O)Cc1c2n(C)c2ccccc12)ccc3O