Reaction Details
TargetKappa-type opioid receptor
LigandBDBM50451343
Substrate/Competitorn/a
Meas. Tech.ChEBML_146664
Ki 8.3±n/a nM
Citation Clayson, JJales, ATyacke, RJHudson, ALNutt, DJLewis, JWHusbands, SM Selective delta-opioid receptor ligands: potential PET ligands based on naltrindole. Bioorg Med Chem Lett11:939-43 (2001) Kappa-type opioid receptor
Name:Kappa-type opioid receptor
Type:G Protein-Coupled Receptor (GPCR)
Mol. Mass.:42744.99
Organism:Cavia porcellus (domestic guinea pig)
Description:P41144
Residue:380
BDBM50451343
NameBDBM50451343
Synonyms:CHEMBL477154
TypeSmall organic molecule
Emp. Form.C27H28N2O3
Mol. Mass.428.5228
SMILES[H][C@@]12Oc3c4c(C[C@@]5([H])N(CC6CC6)CC[C@@]14[C@@]5(O)Cc1c2n(C)c2ccccc12)ccc3O