Reaction Details
TargetAndrogen receptor
LigandBDBM50098985
Substrate/Competitorn/a
Meas. Tech.ChEBML_36425
Ki 150±n/a nM
Citation Van Dort, MEJung, YW Synthesis and structure-activity studies of side-chain derivatized arylhydantoins for investigation as androgen receptor radioligands. Bioorg Med Chem Lett11:1045-7 (2001) Androgen receptor
Name:Androgen receptor
Type:Enzyme
Mol. Mass.:98219.08
Organism:Rattus norvegicus (Rat)
Description:P15207
Residue:902
BDBM50098985
NameBDBM50098985
Synonyms:4-[3-(4-Iodo-benzyl)-4,4-dimethyl-2,5-dioxo-imidazolidin-1-yl]-2-trifluoromethyl-benzonitrile | CHEMBL9447
TypeSmall organic molecule
Emp. Form.C20H15F3IN3O2
Mol. Mass.513.2517
SMILESCC1(C)N(Cc2ccc(I)cc2)C(=O)N(C1=O)c1ccc(C#N)c(c1)C(F)(F)F