Reaction Details
TargetAndrogen receptor
LigandBDBM50098988
Substrate/Competitorn/a
Meas. Tech.ChEBML_36425
Ki 65±n/a nM
Citation Van Dort, MEJung, YW Synthesis and structure-activity studies of side-chain derivatized arylhydantoins for investigation as androgen receptor radioligands. Bioorg Med Chem Lett11:1045-7 (2001) Androgen receptor
Name:Androgen receptor
Type:Enzyme
Mol. Mass.:98219.08
Organism:Rattus norvegicus (Rat)
Description:P15207
Residue:902
BDBM50098988
NameBDBM50098988
Synonyms:4-{3-[3-(4-Iodo-phenyl)-propyl]-4,4-dimethyl-2,5-dioxo-imidazolidin-1-yl}-2-trifluoromethyl-benzonitrile | CHEMBL266786
TypeSmall organic molecule
Emp. Form.C22H19F3IN3O2
Mol. Mass.541.3048
SMILESCC1(C)N(CCCc2ccc(I)cc2)C(=O)N(C1=O)c1ccc(C#N)c(c1)C(F)(F)F