Reaction Details
TargetSomatostatin receptor type 4
LigandBDBM50099179
Substrate/Competitorn/a
Meas. Tech.ChEBML_225195
Ki 5010±n/a nM
Citation Moinet, CContour-Galcéra, MOPoitout, LMorgan, BGordon, TRouber, PThurieau, C Novel non-peptide ligands for the somatostatin sst3 receptor. Bioorg Med Chem Lett11:991-5 (2001) Somatostatin receptor type 4
Name:Somatostatin receptor type 4
Type:Enzyme
Mol. Mass.:42015.38
Organism:Homo sapiens (Human)
Description:P31391
Residue:388
BDBM50099179
NameBDBM50099179
Synonyms:CHEMBL368334 | N-[(R)-2-(1H-Indol-3-yl)-1-(4-phenyl-1H-imidazol-2-yl)-ethyl]-4-methoxy-benzamidine
TypeSmall organic molecule
Emp. Form.C27H25N5O
Mol. Mass.435.5203
SMILESCOc1ccc(cc1)C(N)=N[C@H](Cc1c[nH]c2ccccc12)c1nc(c[nH]1)-c1ccccc1