Reaction Details
TargetSomatostatin receptor type 1
LigandBDBM50099176
Substrate/Competitorn/a
Meas. Tech.ChEBML_225192
Ki 2570±n/a nM
Citation Moinet, CContour-Galcéra, MOPoitout, LMorgan, BGordon, TRouber, PThurieau, C Novel non-peptide ligands for the somatostatin sst3 receptor. Bioorg Med Chem Lett11:991-5 (2001) Somatostatin receptor type 1
Name:Somatostatin receptor type 1
Type:Enzyme
Mol. Mass.:42692.81
Organism:Homo sapiens (Human)
Description:P30872
Residue:391
BDBM50099176
NameBDBM50099176
Synonyms:CHEMBL176313 | N-[(R)-2-(1H-Indol-3-yl)-1-(4-phenyl-1H-imidazol-2-yl)-ethyl]-4-trifluoromethoxy-benzamidine
TypeSmall organic molecule
Emp. Form.C27H22F3N5O
Mol. Mass.489.4917
SMILESNC(=N[C@H](Cc1c[nH]c2ccccc12)c1nc(c[nH]1)-c1ccccc1)c1ccc(OC(F)(F)F)cc1