Reaction Details
TargetSomatostatin receptor type 3
LigandBDBM50099174
Substrate/Competitorn/a
Meas. Tech.ChEBML_225194
Ki 79±n/a nM
Citation Moinet, CContour-Galcéra, MOPoitout, LMorgan, BGordon, TRouber, PThurieau, C Novel non-peptide ligands for the somatostatin sst3 receptor. Bioorg Med Chem Lett11:991-5 (2001) Somatostatin receptor type 3
Name:Somatostatin receptor type 3
Type:Protein
Mol. Mass.:45855.97
Organism:Homo sapiens (Human)
Description:P32745
Residue:418
BDBM50099174
NameBDBM50099174
Synonyms:4-Chloro-N-[(R)-2-(1H-indol-3-yl)-1-(4-phenyl-1H-imidazol-2-yl)-ethyl]-benzamidine | CHEMBL362859
TypeSmall organic molecule
Emp. Form.C26H22ClN5
Mol. Mass.439.939
SMILESNC(=N[C@H](Cc1c[nH]c2ccccc12)c1nc(c[nH]1)-c1ccccc1)c1ccc(Cl)cc1