Reaction Details
TargetSomatostatin receptor type 2
LigandBDBM50099182
Substrate/Competitorn/a
Meas. Tech.ChEBML_225193
Ki 8680±n/a nM
Citation Moinet, CContour-Galcéra, MOPoitout, LMorgan, BGordon, TRouber, PThurieau, C Novel non-peptide ligands for the somatostatin sst3 receptor. Bioorg Med Chem Lett11:991-5 (2001) Somatostatin receptor type 2
Name:Somatostatin receptor type 2
Type:Enzyme
Mol. Mass.:41344.94
Organism:Homo sapiens (Human)
Description:P30874
Residue:369
BDBM50099182
NameBDBM50099182
Synonyms:CHEMBL174872 | N-[(R)-2-(1H-Indol-3-yl)-1-(4-phenyl-1H-imidazol-2-yl)-ethyl]-benzamidine
TypeSmall organic molecule
Emp. Form.C26H23N5
Mol. Mass.405.4943
SMILESNC(=N[C@H](Cc1c[nH]c2ccccc12)c1nc(c[nH]1)-c1ccccc1)c1ccccc1