Reaction Details
TargetSomatostatin receptor type 5
LigandBDBM50099173
Substrate/Competitorn/a
Meas. Tech.ChEBML_225196
Ki 2250±n/a nM
Citation Moinet, CContour-Galcéra, MOPoitout, LMorgan, BGordon, TRouber, PThurieau, C Novel non-peptide ligands for the somatostatin sst3 receptor. Bioorg Med Chem Lett11:991-5 (2001) Somatostatin receptor type 5
Name:Somatostatin receptor type 5
Type:Enzyme
Mol. Mass.:39218.02
Organism:Homo sapiens (Human)
Description:P35346
Residue:364
BDBM50099173
NameBDBM50099173
Synonyms:2,4-Difluoro-N-[(R)-2-(1H-indol-3-yl)-1-(4-phenyl-1H-imidazol-2-yl)-ethyl]-benzamidine | CHEMBL175197
TypeSmall organic molecule
Emp. Form.C26H21F2N5
Mol. Mass.441.4752
SMILESNC(=N[C@H](Cc1c[nH]c2ccccc12)c1nc(c[nH]1)-c1ccccc1)c1ccc(F)cc1F