Reaction Details
TargetAlpha-1D adrenergic receptor
LigandBDBM50099327
Substrate/Competitorn/a
Meas. Tech.ChEBML_32724
Ki 0.361000±n/a nM
Citation Carroll, WASippy, KBEsbenshade, TABuckner, SAHancock, AAMeyer, MD Two novel and potent 3-[(o-methoxyphenyl)piperazinylethyl]-5-phenylthien. Bioorg Med Chem Lett11:1119-21 (2001) Alpha-1D adrenergic receptor
Name:Alpha-1D adrenergic receptor
Type:Protein
Mol. Mass.:59375.97
Organism:Rattus norvegicus (Rat)
Description:P23944
Residue:561
BDBM50099327
NameBDBM50099327
Synonyms:3-{2-[4-(2-Methoxy-phenyl)-piperazin-1-yl]-ethyl}-6-phenyl-1H-thieno[2,3-d]pyrimidine-2,4-dione | CHEMBL13903
TypeSmall organic molecule
Emp. Form.C25H26N4O3S
Mol. Mass.462.564
SMILESCOc1ccccc1N1CCN(CCn2c(=O)[nH]c3sc(cc3c2=O)-c2ccccc2)CC1