Reaction Details
TargetAlpha-1D adrenergic receptor
LigandBDBM50099322
Substrate/Competitorn/a
Meas. Tech.ChEBML_32439
Ki 0.252000±n/a nM
Citation Carroll, WASippy, KBEsbenshade, TABuckner, SAHancock, AAMeyer, MD Two novel and potent 3-[(o-methoxyphenyl)piperazinylethyl]-5-phenylthien. Bioorg Med Chem Lett11:1119-21 (2001) Alpha-1D adrenergic receptor
Name:Alpha-1D adrenergic receptor
Type:Enzyme Catalytic Domain
Mol. Mass.:60485.82
Organism:Homo sapiens (Human)
Description:adrenergic Alpha1D ADRA1D HUMAN::P25100
Residue:572
BDBM50099322
NameBDBM50099322
Synonyms:3-{2-[4-(2-Methoxy-phenyl)-piperazin-1-yl]-ethyl}-5-phenyl-1H-thieno[2,3-d]pyrimidine-2,4-dione CHEMBL268758
TypeSmall organic molecule
Emp. Form.C25H26N4O3S
Mol. Mass.462.564
SMILESCOc1ccccc1N1CCN(CCn2c(=O)[nH]c3scc(-c4ccccc4)c3c2=O)CC1