Reaction Details
TargetNeuronal acetylcholine receptor subunit alpha-7
LigandBDBM50099562
Substrate/Competitorn/a
Meas. Tech.ChEBML_144170
Ki 590±n/a nM
Citation Xu, RDwoskin, LPGrinevich, VPDeaciuc, GCrooks, PA Neuronal nicotinic acetylcholine receptor binding affinities of boron-containing nicotine analogues. Bioorg Med Chem Lett11:1245-8 (2001) Neuronal acetylcholine receptor subunit alpha-7
Name:Neuronal acetylcholine receptor subunit alpha-7
Type:Enzyme
Mol. Mass.:56502.44
Organism:Rattus norvegicus (Rat)
Description:Q05941
Residue:502
BDBM50099562
NameBDBM50099562
Synonyms:(3aS,9bR)-1-Methyl-2,3,3a,4,5,9b-hexahydro-1H-pyrrolo[3,2-h]isoquinoline | CHEMBL417278
TypeSmall organic molecule
Emp. Form.C12H16N2
Mol. Mass.188.2688
SMILESCN1CC[C@@H]2CCc3ccncc3[C@H]12