Reaction Details
TargetProthrombin
LigandBDBM50228863
Substrate/Competitorn/a
Meas. Tech.ChEMBL_87153 (CHEMBL697449)
IC50 18±n/a nM
Citation Das, JKimball, SDReid, JAWang, TCLau, WFRoberts, DGSeiler, SMSchumacher, WAOgletree, ML Thrombin active site inhibitors: chemical synthesis, in vitro and in vivo pharmacological profile of a novel and selective agent BMS-189090 and analogues. Bioorg Med Chem Lett12:41-4 (2001) Prothrombin
Name:Prothrombin
Type:Protein
Mol. Mass.:70029.57
Organism:Homo sapiens (Human)
Description:P00734
Residue:622
BDBM50228863
NameBDBM50228863
Synonyms:(S)-1-((R)-2-Methylamino-3-phenyl-propionyl)-pyrrolidine-2-carboxylic acid ((S)-1-formyl-4-guanidino-butyl)-amide 5N-[4-amino(imino)methylamino-1-formyl-(1S)-butyl]-1-[2-methylamino-3-phenyl-(2R)-propanoyl]-(5S)-dihydro-1H-5-pyrrolecarboxamide Me-(D-Phe)-Pro-Arg-CHO
TypeSmall organic molecule
Emp. Form.C21H32N6O3
Mol. Mass.416.5172
SMILES[#6]-[#7]-[#6@H](-[#6]-c1ccccc1)-[#6](=O)-[#7]-1-[#6]-[#6]-[#6]-[#6@H]-1-[#6](=O)-[#7]-[#6@@H](-[#6]-[#6]-[#6]\[#7]=[#6](\[#7])-[#7])-[#6]=O