Reaction Details
TargetProthrombin
LigandBDBM50107456
Substrate/Competitorn/a
Meas. Tech.ChEBML_207982
IC50 12000±n/a nM
Citation Das, JKimball, SDHall, SEHan, WCIwanowicz, ELin, JMoquin, RVReid, JASack, JSMalley, MFChang, CYChong, SWang-Iverson, DBRoberts, DGSeiler, SMSchumacher, WAOgletree, ML Molecular design and structure--activity relationships leading to the potent, selective, and orally active thrombin active site inhibitor BMS-189664. Bioorg Med Chem Lett12:45-9 (2001) Prothrombin
Name:Prothrombin
Type:Protein
Mol. Mass.:70029.57
Organism:Homo sapiens (Human)
Description:P00734
Residue:622
BDBM50107456
NameBDBM50107456
Synonyms:(S)-1-[(S)-2-(Naphthalene-2-sulfonylamino)-3-phenyl-propionyl]-pyrrolidine-2-carboxylic acid (4-guanidino-butyl)-amide | CHEMBL144529
TypeSmall organic molecule
Emp. Form.C29H36N6O4S
Mol. Mass.564.699
SMILESNC(=N)NCCCCNC(=O)[C@@H]1CCCN1C(=O)[C@H](Cc1ccccc1)NS(=O)(=O)c1ccc2ccccc2c1