Reaction Details
TargetD(4) dopamine receptor
LigandBDBM50112787
Substrate/Competitorn/a
Meas. Tech.ChEBML_60687
Ki 12±n/a nM
Citation Cha, MYChoi, BCKang, KHPae, ANChoi, KICho, YSKoh, HYLee, HYJung, DKong, JY Design and synthesis of a piperazinylalkylisoxazole library for subtype selective dopamine receptor ligands. Bioorg Med Chem Lett12:1327-30 (2002) D(4) dopamine receptor
Name:D(4) dopamine receptor
Type:Enzyme
Mol. Mass.:48373.19
Organism:Homo sapiens (Human)
Description:P21917
Residue:419
BDBM50112787
NameBDBM50112787
Synonyms:1-(2-Ethoxy-phenyl)-4-[4-(3-thiophen-2-yl-isoxazol-5-yl)-butyl]-piperazine; hydrochloride | CHEMBL557829
TypeSmall organic molecule
Emp. Form.C23H29N3O2S
Mol. Mass.411.56
SMILESCCOc1ccccc1N1CCN(CCCCc2cc(no2)-c2cccs2)CC1