Reaction Details
TargetD(3) dopamine receptor
LigandBDBM50112794
Substrate/Competitorn/a
Meas. Tech.ChEBML_62274
Ki 15±n/a nM
Citation Cha, MYChoi, BCKang, KHPae, ANChoi, KICho, YSKoh, HYLee, HYJung, DKong, JY Design and synthesis of a piperazinylalkylisoxazole library for subtype selective dopamine receptor ligands. Bioorg Med Chem Lett12:1327-30 (2002) D(3) dopamine receptor
Name:D(3) dopamine receptor
Type:n/a
Mol. Mass.:44243.43
Organism:Homo sapiens (Human)
Description:n/a
Residue:400
BDBM50112794
NameBDBM50112794
Synonyms:1-Phenyl-4-[4-(3-thiophen-2-yl-isoxazol-5-yl)-butyl]-piperazine; hydrochloride | CHEMBL542324
TypeSmall organic molecule
Emp. Form.C21H25N3OS
Mol. Mass.367.508
SMILESC(CCc1cc(no1)-c1cccs1)CN1CCN(CC1)c1ccccc1