Reaction Details
TargetD(3) dopamine receptor
LigandBDBM50112793
Substrate/Competitorn/a
Meas. Tech.ChEBML_62274
Ki 24±n/a nM
Citation Cha, MYChoi, BCKang, KHPae, ANChoi, KICho, YSKoh, HYLee, HYJung, DKong, JY Design and synthesis of a piperazinylalkylisoxazole library for subtype selective dopamine receptor ligands. Bioorg Med Chem Lett12:1327-30 (2002) D(3) dopamine receptor
Name:D(3) dopamine receptor
Type:n/a
Mol. Mass.:44243.43
Organism:Homo sapiens (Human)
Description:n/a
Residue:400
BDBM50112793
NameBDBM50112793
Synonyms:1-{4-[3-(3,4-Dimethoxy-phenyl)-isoxazol-5-yl]-butyl}-4-phenyl-piperazine; hydrochloride | CHEMBL557409
TypeSmall organic molecule
Emp. Form.C25H31N3O3
Mol. Mass.421.5319
SMILESCOc1ccc(cc1OC)-c1cc(CCCCN2CCN(CC2)c2ccccc2)on1