Reaction Details
TargetD(3) dopamine receptor
LigandBDBM50112802
Substrate/Competitorn/a
Meas. Tech.ChEBML_62274
Ki 27±n/a nM
Citation Cha, MYChoi, BCKang, KHPae, ANChoi, KICho, YSKoh, HYLee, HYJung, DKong, JY Design and synthesis of a piperazinylalkylisoxazole library for subtype selective dopamine receptor ligands. Bioorg Med Chem Lett12:1327-30 (2002) D(3) dopamine receptor
Name:D(3) dopamine receptor
Type:n/a
Mol. Mass.:44243.43
Organism:Homo sapiens (Human)
Description:n/a
Residue:400
BDBM50112802
NameBDBM50112802
Synonyms:1-Phenyl-4-[4-(3-styryl-isoxazol-5-yl)-butyl]-piperazine; hydrochloride | CHEMBL543277
TypeSmall organic molecule
Emp. Form.C25H29N3O
Mol. Mass.387.5173
SMILESC(CCc1cc(\C=C\c2ccccc2)no1)CN1CCN(CC1)c1ccccc1