Reaction Details
TargetD(3) dopamine receptor
LigandBDBM50112807
Substrate/Competitorn/a
Meas. Tech.ChEBML_62274
Ki 16±n/a nM
Citation Cha, MYChoi, BCKang, KHPae, ANChoi, KICho, YSKoh, HYLee, HYJung, DKong, JY Design and synthesis of a piperazinylalkylisoxazole library for subtype selective dopamine receptor ligands. Bioorg Med Chem Lett12:1327-30 (2002) D(3) dopamine receptor
Name:D(3) dopamine receptor
Type:n/a
Mol. Mass.:44243.43
Organism:Homo sapiens (Human)
Description:n/a
Residue:400
BDBM50112807
NameBDBM50112807
Synonyms:1-{4-[3-(2,4-Dimethoxy-phenyl)-isoxazol-5-yl]-butyl}-4-phenyl-piperazine; hydrochloride | CHEMBL542573
TypeSmall organic molecule
Emp. Form.C25H31N3O3
Mol. Mass.421.5319
SMILESCOc1ccc(-c2cc(CCCCN3CCN(CC3)c3ccccc3)on2)c(OC)c1