Reaction Details
TargetD(4) dopamine receptor
LigandBDBM50112813
Substrate/Competitorn/a
Meas. Tech.ChEBML_60687
Ki 50±n/a nM
Citation Cha, MYChoi, BCKang, KHPae, ANChoi, KICho, YSKoh, HYLee, HYJung, DKong, JY Design and synthesis of a piperazinylalkylisoxazole library for subtype selective dopamine receptor ligands. Bioorg Med Chem Lett12:1327-30 (2002) D(4) dopamine receptor
Name:D(4) dopamine receptor
Type:Enzyme
Mol. Mass.:48373.19
Organism:Homo sapiens (Human)
Description:P21917
Residue:419
BDBM50112813
NameBDBM50112813
Synonyms:1-(2-Methoxy-phenyl)-4-{4-[3-(3-nitro-phenyl)-isoxazol-5-yl]-butyl}-piperazine; hydrochloride | CHEMBL541270
TypeSmall organic molecule
Emp. Form.C24H28N4O4
Mol. Mass.436.5035
SMILESCOc1ccccc1N1CCN(CCCCc2cc([n-][o+]2)-c2cccc(c2)[N+]([O-])=O)CC1