Reaction Details
TargetSteryl-sulfatase
LigandBDBM50134329
Substrate/Competitorn/a
Meas. Tech.ChEBML_67985
IC50 80±n/a nM
Citation Jütten, PSchumann, WHärtl, AHeinisch, LGräfe, UWerner, WUlbricht, H A novel type of nonsteroidal estrone sulfatase inhibitors. Bioorg Med Chem Lett12:1339-42 (2002) Steryl-sulfatase
Name:Steryl-sulfatase
Type:Enzyme
Mol. Mass.:65503.66
Organism:Homo sapiens (Human)
Description:P08842
Residue:583
BDBM50134329
NameBDBM50134329
Synonyms:CHEMBL122708 Sulfamic acid (8R,9S,13S,14S)-13-methyl-17-oxo-7,8,9,11,12,13,14,15,16,17-decahydro-6H-cyclopenta[a]phenanthren-3-yl ester estrone3-O-sulfamate
TypeSmall organic molecule
Emp. Form.C18H23NO4S
Mol. Mass.349.445
SMILESC[C@]12CC[C@H]3[C@@H](CCc4cc(OS(N)(=O)=O)ccc34)[C@@H]1CCC2=O