Reaction Details
TargetGag-Pol polyprotein [489-587]
LigandBDBM50114965
Substrate/Competitorn/a
Meas. Tech.ChEBML_79805
IC50 8950±n/a nM
Citation Murphy, PVO'Brien, JLGorey-Feret, LJSmith, AB Structure-based design and synthesis of HIV-1 protease inhibitors employing beta-D-mannopyranoside scaffolds. Bioorg Med Chem Lett12:1763-6 (2002) Gag-Pol polyprotein [489-587]
Name:Gag-Pol polyprotein [489-587]
Type:Enzyme Subunit
Mol. Mass.:10781.16
Organism:Human immunodeficiency virus type 1
Description:P04585[489-587]
Residue:99
BDBM50114965
NameBDBM50114965
Synonyms:CHEMBL52487 | N-((3S,5R,6S)-3,4,5-Trihydroxy-6-phenoxy-tetrahydro-pyran-2-ylmethyl)-acetamide
TypeSmall organic molecule
Emp. Form.C14H19NO6
Mol. Mass.297.3038
SMILESCC(=O)NCC1O[C@@H](Oc2ccccc2)[C@@H](O)C(O)[C@@H]1O