Reaction Details
Target4-hydroxyphenylpyruvate dioxygenase
LigandBDBM50403921
Substrate/Competitorn/a
Meas. Tech.ChEMBL_542 (CHEMBL615562)
IC50 20±n/a nM
Citation Huang, MYang, DYShang, ZZou, JYu, Q 3D-QSAR studies on 4-hydroxyphenylpyruvate dioxygenase inhibitors by comparative molecular field analysis (CoMFA). Bioorg Med Chem Lett12:2271-5 (2002) 4-hydroxyphenylpyruvate dioxygenase
Name:4-hydroxyphenylpyruvate dioxygenase
Type:PROTEIN
Mol. Mass.:45064.25
Organism:Sus scrofa
Description:ChEMBL_541
Residue:393
BDBM50403921
NameBDBM50403921
Synonyms:CHEMBL309664
TypeSmall organic molecule
Emp. Form.C10H11ClO3
Mol. Mass.214.646
SMILESClC1=C(CCCC1=O)OC(=O)C1CC1