Reaction Details
TargetIsoform 4 of Membrane-associated guanylate kinase, WW and PDZ domain-containing protein 3 (4)
LigandBDBM50116992
Substrate/Competitorn/a
Meas. Tech.ChEBML_99589
IC50 14400±n/a nM
Citation Novak, KAFujii, NGuy, RK Investigation of the PDZ domain ligand binding site using chemically modified peptides. Bioorg Med Chem Lett12:2471-4 (2002) Isoform 4 of Membrane-associated guanylate kinase, WW and PDZ domain-containing protein 3 (4)
Name:Isoform 4 of Membrane-associated guanylate kinase, WW and PDZ domain-containing protein 3 (4)
Type:PROTEIN
Mol. Mass.:165630.05
Organism:Homo sapiens (Human)
Description:ChEMBL_99591
Residue:1506
BDBM50116992
NameBDBM50116992
Synonyms:CHEMBL407790 | PFDEDQHTQIAKV
TypeSmall organic molecule
Emp. Form.C67H102N18O23
Mol. Mass.1527.6336
SMILESCC[C@H](C)[C@H](NC(=O)[C@H](CCC(N)=O)NC(=O)[C@@H](NC(=O)[C@H](Cc1cnc[nH]1)NC(=O)[C@H](CCC(N)=O)NC(=O)[C@H](CC(O)=O)NC(=O)[C@H](CCC(O)=O)NC(=O)[C@H](CC(O)=O)NC(=O)[C@H](Cc1ccccc1)NC(=O)[C@@H]1CCCN1)[C@@H](C)O)C(=O)N[C@@H](C)C(=O)N[C@@H](CCCCN)C(=O)N[C@@H](C(C)C)C(O)=O