Reaction Details
TargetAcetylcholinesterase
LigandBDBM50117585
Substrate/Competitorn/a
Meas. Tech.ChEBML_70883
EC50 1600±n/a nM
Citation Clark, JKCowley, PMuir, AWPalin, RPow, EProsser, ABTaylor, RZhang, MQ Quaternary salts of E2020 analogues as acetylcholinesterase inhibitors for the reversal of neuromuscular block. Bioorg Med Chem Lett12:2565-8 (2002) Acetylcholinesterase
Name:Acetylcholinesterase
Type:Enzyme
Mol. Mass.:67792.70
Organism:Homo sapiens (Human)
Description:P22303
Residue:614
BDBM50117585
NameBDBM50117585
Synonyms:1-Benzyl-4-[3-(5,6-dimethoxy-1-methyl-1H-indol-2-yl)-3-oxo-propyl]-1-methyl-piperidinium | CHEMBL432376
TypeSmall organic molecule
Emp. Form.C27H35N2O3
Mol. Mass.435.5779
SMILESCOc1cc2cc(C(=O)CCC3CC[N+](C)(Cc4ccccc4)CC3)n(C)c2cc1OC