Reaction Details
TargetAcetylcholinesterase
LigandBDBM50117576
Substrate/Competitorn/a
Meas. Tech.ChEMBL_70883 (CHEMBL684541)
EC50 530±n/a nM
Citation Clark, JKCowley, PMuir, AWPalin, RPow, EProsser, ABTaylor, RZhang, MQ Quaternary salts of E2020 analogues as acetylcholinesterase inhibitors for the reversal of neuromuscular block. Bioorg Med Chem Lett12:2565-8 (2002) Acetylcholinesterase
Name:Acetylcholinesterase
Type:Enzyme
Mol. Mass.:67792.70
Organism:Homo sapiens (Human)
Description:P22303
Residue:614
BDBM50117576
NameBDBM50117576
Synonyms:1-Benzyl-4-[3-(6-methoxy-naphthalen-2-yl)-3-oxo-propyl]-1-methyl-piperidinium | CHEMBL87823
TypeSmall organic molecule
Emp. Form.C27H32NO2
Mol. Mass.402.5479
SMILESCOc1ccc2cc(ccc2c1)C(=O)CCC1CC[N+](C)(Cc2ccccc2)CC1