Reaction Details
TargetAcetylcholinesterase
LigandBDBM50117580
Substrate/Competitorn/a
Meas. Tech.ChEBML_70883
EC50 331±n/a nM
Citation Clark, JKCowley, PMuir, AWPalin, RPow, EProsser, ABTaylor, RZhang, MQ Quaternary salts of E2020 analogues as acetylcholinesterase inhibitors for the reversal of neuromuscular block. Bioorg Med Chem Lett12:2565-8 (2002) Acetylcholinesterase
Name:Acetylcholinesterase
Type:Enzyme
Mol. Mass.:67792.70
Organism:Homo sapiens (Human)
Description:P22303
Residue:614
BDBM50117580
NameBDBM50117580
Synonyms:1-Benzyl-1-methyl-4-[3-oxo-3-(2,3,4,5-tetrahydro-1H-benzo[b]azepin-8-yl)-propyl]-piperidinium TAK-147
TypeSmall organic molecule
Emp. Form.C26H35N2O
Mol. Mass.391.5684
SMILESC[N+]1(Cc2ccccc2)CCC(CCC(=O)c2ccc3CCCCNc3c2)CC1