Reaction Details
TargetAcetylcholinesterase
LigandBDBM50117586
Substrate/Competitorn/a
Meas. Tech.ChEBML_70883
EC50 43500±n/a nM
Citation Clark, JKCowley, PMuir, AWPalin, RPow, EProsser, ABTaylor, RZhang, MQ Quaternary salts of E2020 analogues as acetylcholinesterase inhibitors for the reversal of neuromuscular block. Bioorg Med Chem Lett12:2565-8 (2002) Acetylcholinesterase
Name:Acetylcholinesterase
Type:Enzyme
Mol. Mass.:67792.70
Organism:Homo sapiens (Human)
Description:P22303
Residue:614
BDBM50117586
NameBDBM50117586
Synonyms:1,1-Dibenzyl-4-[(5,6-dimethoxy-1-oxo-indan-2-yl)-hydroxy-methyl]-piperidinium | CHEMBL313234
TypeSmall organic molecule
Emp. Form.C31H36NO4
Mol. Mass.486.6213
SMILESCOc1cc2CC(C(O)C3CC[N+](Cc4ccccc4)(Cc4ccccc4)CC3)C(=O)c2cc1OC