Reaction Details
Target5-hydroxytryptamine receptor 4
LigandBDBM50108392
Substrate/Competitorn/a
Meas. Tech.ChEBML_3260
Ki 125±n/a nM
Citation Iriepa, IVillasante, FJGálvez, ELabeaga, LInnerarity, AOrjales, A Synthesis and pharmacology of isoquinuclidine derivatives as 5-HT(3) ligands. Bioorg Med Chem Lett12:189-92 (2001) 5-hydroxytryptamine receptor 4
Name:5-hydroxytryptamine receptor 4
Type:Enzyme Catalytic Domain
Mol. Mass.:43735.29
Organism:GUINEA PIG
Description:5-HT4 HTR4 GUINEA PIG::O70528
Residue:388
BDBM50108392
NameBDBM50108392
Synonyms:(3-ENDO)-8-METHYL-8-AZABICYCLO[3.2.1]OCT-3-YL 1H-INDOLE-3-CARBOXYLATE | CHEMBL56564
TypeSmall organic molecule
Emp. Form.C17H20N2O2
Mol. Mass.284.3529
SMILESCN1[C@H]2CC[C@@H]1C[C@@H](C2)OC(=O)c1c[nH]c2ccccc12