Reaction Details
TargetcAMP-specific 3',5'-cyclic phosphodiesterase 4B
LigandBDBM50108504
Substrate/Competitorn/a
Meas. Tech.ChEBML_155170
IC50 34±n/a nM
Citation Hersperger, RDawson, JMueller, T Synthesis of 4-(8-benzo[1,2,5]oxadiazol-5-yl-[1,7]naphthyridine-6-yl)-benzoic acid: a potent and selective phosphodiesterase type 4D inhibitor. Bioorg Med Chem Lett12:233-5 (2001) cAMP-specific 3',5'-cyclic phosphodiesterase 4B
Name:cAMP-specific 3',5'-cyclic phosphodiesterase 4B
Type:Protein
Mol. Mass.:83318.87
Organism:Homo sapiens (Human)
Description:Q07343
Residue:736
BDBM50108504
NameBDBM50108504
Synonyms:4-(8-(benzo[c][1,2,5]oxadiazol-5-yl)-1,7-naphthyridin-6-yl)benzoic acid CHEMBL77826
TypeSmall organic molecule
Emp. Form.C21H12N4O3
Mol. Mass.368.345
SMILESOC(=O)c1ccc(cc1)-c1cc2cccnc2c(n1)-c1ccc2nonc2c1