Reaction Details
TargetTissue alpha-L-fucosidase
LigandBDBM50118928
Substrate/Competitorn/a
Meas. Tech.ChEBML_33957
Ki 32±n/a nM
Citation Ogawa, SMori, MTakeuchi, GDoi, FWatanabe, MSakata, Y Convenient synthesis and evaluation of enzyme inhibitory activity of several N-alkyl-, N-phenylalkyl, and cyclic isourea derivatives of 5a-carba-alpha-DL-fucopyranosylamine. Bioorg Med Chem Lett12:2811-4 (2002) Tissue alpha-L-fucosidase
Name:Tissue alpha-L-fucosidase
Type:PROTEIN
Mol. Mass.:53690.69
Organism:Homo sapiens (Human)
Description:ChEMBL_34088
Residue:466
BDBM50118928
NameBDBM50118928
Synonyms:(1S,2S,3R)-4-Methyl-6-phenethylamino-cyclohexane-1,2,3-triol CHEMBL316609
TypeSmall organic molecule
Emp. Form.C15H23NO3
Mol. Mass.265.348
SMILESCC1CC(NCCc2ccccc2)C(O)C(O)C1O