Reaction Details
TargetEpidermal growth factor receptor
LigandBDBM50119073
Substrate/Competitorn/a
Meas. Tech.ChEBML_66581
IC50 850±n/a nM
Citation Wissner, ABrawner Floyd, MBRabindran, SKNilakantan, RGreenberger, LMShen, RWang, YFTsou, HR Syntheses and EGFR and HER-2 kinase inhibitory activities of 4-anilinoquinoline-3-carbonitriles: analogues of three important 4-anilinoquinazolines currently undergoing clinical evaluation as therapeutic antitumor agents. Bioorg Med Chem Lett12:2893-7 (2002) Epidermal growth factor receptor
Name:Epidermal growth factor receptor
Type:Receptor Kinase Domain
Mol. Mass.:134279.59
Organism:Homo sapiens (Human)
Description:P00533
Residue:1210
BDBM50119073
NameBDBM50119073
Synonyms:4-(3-Ethynyl-phenylamino)-6,7-bis-(2-methoxy-ethoxy)-quinoline-3-carbonitrile | CHEMBL95320
TypeSmall organic molecule
Emp. Form.C24H23N3O4
Mol. Mass.417.4571
SMILESCOCCOc1cc2ncc(C#N)c(Nc3cccc(c3)C#C)c2cc1OCCOC