Reaction Details
TargetNeuronal acetylcholine receptor subunit alpha-7
LigandBDBM50366799
Substrate/Competitorn/a
Meas. Tech.ChEBML_144178
Ki 4790±n/a nM
Citation Ayers, JTDwoskin, LPDeaciuc, AGGrinevich, VPZhu, JCrooks, PA bis-Azaaromatic quaternary ammonium analogues: ligands for alpha4beta2* and alpha7* subtypes of neuronal nicotinic receptors. Bioorg Med Chem Lett12:3067-71 (2002) Neuronal acetylcholine receptor subunit alpha-7
Name:Neuronal acetylcholine receptor subunit alpha-7
Type:Enzyme
Mol. Mass.:56502.44
Organism:Rattus norvegicus (Rat)
Description:Q05941
Residue:502
BDBM50366799
NameBDBM50366799
Synonyms:TUBOCURARINE | TUBOCURARINE CHLORIDE
TypeSmall organic molecule
Emp. Form.C37H41N2O6
Mol. Mass.609.7307
SMILESCOc1cc2CC[N+](C)(C)[C@@H]3Cc4ccc(O)c(Oc5cc6[C@H](Cc7ccc(Oc(c1O)c23)cc7)N(C)CCc6cc5OC)c4