Reaction Details
TargetDelta-type opioid receptor
LigandBDBM50120141
Substrate/Competitorn/a
Meas. Tech.ChEBML_145476
Ki 31780±n/a nM
Citation Wu, WLCaplen, MADomalski, MSZhang, HFawzi, ABurnett, DA Synthesis and structure-activity relationships of aminoalkylazetidines as ORL1 receptor ligands. Bioorg Med Chem Lett12:3157-60 (2002) Delta-type opioid receptor
Name:Delta-type opioid receptor
Type:G Protein-Coupled Receptor (GPCR)
Mol. Mass.:40382.98
Organism:Homo sapiens (Human)
Description:Competition binding assays were carried out using membrane preparations from transfected HN9.10 cells that constitutively expressed the delta opioid receptor.
Residue:372
BDBM50120141
NameBDBM50120141
Synonyms:C-[(S)-C-[(S)-1-(1-Butyl-pentyl)-azetidin-2-yl]-C-(3-chloro-phenyl)]-methylamine | CHEMBL106359
TypeSmall organic molecule
Emp. Form.C19H31ClN2
Mol. Mass.322.916
SMILESCCCCC(CCCC)N1CC[C@H]1[C@@H](N)c1cccc(Cl)c1