Reaction Details
TargetDelta-type opioid receptor
LigandBDBM50120161
Substrate/Competitorn/a
Meas. Tech.ChEBML_145476
Ki 1439±n/a nM
Citation Wu, WLCaplen, MADomalski, MSZhang, HFawzi, ABurnett, DA Synthesis and structure-activity relationships of aminoalkylazetidines as ORL1 receptor ligands. Bioorg Med Chem Lett12:3157-60 (2002) Delta-type opioid receptor
Name:Delta-type opioid receptor
Type:G Protein-Coupled Receptor (GPCR)
Mol. Mass.:40382.98
Organism:Homo sapiens (Human)
Description:Competition binding assays were carried out using membrane preparations from transfected HN9.10 cells that constitutively expressed the delta opioid receptor.
Residue:372
BDBM50120161
NameBDBM50120161
Synonyms:C-[(S)-C-((S)-1-Benzhydryl-azetidin-2-yl)-C-(4-chloro-phenyl)]-methylamine | CHEMBL108904
TypeSmall organic molecule
Emp. Form.C23H23ClN2
Mol. Mass.362.895
SMILESN[C@H]([C@@H]1CCN1C(c1ccccc1)c1ccccc1)c1ccc(Cl)cc1