Reaction Details
TargetDelta-type opioid receptor
LigandBDBM50120163
Substrate/Competitorn/a
Meas. Tech.ChEBML_145476
Ki 4978±n/a nM
Citation Wu, WLCaplen, MADomalski, MSZhang, HFawzi, ABurnett, DA Synthesis and structure-activity relationships of aminoalkylazetidines as ORL1 receptor ligands. Bioorg Med Chem Lett12:3157-60 (2002) Delta-type opioid receptor
Name:Delta-type opioid receptor
Type:G Protein-Coupled Receptor (GPCR)
Mol. Mass.:40382.98
Organism:Homo sapiens (Human)
Description:Competition binding assays were carried out using membrane preparations from transfected HN9.10 cells that constitutively expressed the delta opioid receptor.
Residue:372
BDBM50120163
NameBDBM50120163
Synonyms:C-{(S)-C-(3-Chloro-phenyl)-C-[(S)-1-(1-phenyl-heptyl)-azetidin-2-yl]}-methylamine | CHEMBL322717
TypeSmall organic molecule
Emp. Form.C23H31ClN2
Mol. Mass.370.959
SMILESCCCCCCC(N1CC[C@H]1[C@@H](N)c1cccc(Cl)c1)c1ccccc1